Target
Low molecular weight phosphotyrosine protein phosphatase
Ligand
BDBM94888
Substrate
IC50
3490±n/a nM
Citation
 PubChem, PC Dose response confirmation of small molecule inhibitors of Low Molecular Weight Protein Tyrosine Phosphatase, LMPTP, via a fluorescence intensity assay PubChem Bioassay (2012)[AID] 
Target
Name:
Low molecular weight phosphotyrosine protein phosphatase
Synonyms:
3.1.3.2 ACP1 LMW-PTP LMWPTP PPAC_HUMAN low molecular weight phosphotyrosine protein phosphatase isoform c
Type:
Mol. Mass.:
18042.81
Organism:
Homo sapiens (Human)
Description:
P24666
Residue:
158
  
Inhibitor
Name:
BDBM94888
Synonyms:
(2-phenyl-4-quinolyl)-(2-piperidinoethyl)amine 2-phenyl-N-[2-(1-piperidinyl)ethyl]-4-quinolinamine SMR000567889 | cid_2728458
Type:
Small organic molecule
Emp. Form.:
C22H25N3
Mol. Mass.:
331.454
SMILES:
C(CN1CCCCC1)Nc1cc(nc2ccccc12)-c1ccccc1
: