Target
Hepatocyte nuclear factor 4-alpha
Ligand
BDBM94633
Substrate
IC50
1870±n/a nM
Citation
 PubChem, PC Counterscreen for inhibitors of the interaction of the lipase co-activator protein, abhydrolase domain containing 5 (ABHD5) with perilipin-5 (MLDP; PLIN5): Luminescence-based biochemical high throughput dose response assay to identify inhibitors of Hepatocyte nuclear factor 4 (HNF4) dimerization PubChem Bioassay (2012)[AID] 
Target
Name:
Hepatocyte nuclear factor 4-alpha
Synonyms:
HNF4 HNF4A_HUMAN TCF14 | hepatocyte nuclear factor 4-alpha isoform b
Type:
PROTEIN
Mol. Mass.:
52790.24
Organism:
Homo sapiens (Human)
Description:
ChEMBL_606516
Residue:
474
  
Inhibitor
Name:
BDBM94633
Synonyms:
2-[4-(1,3-benzodioxol-5-yl)-2-ethyl-2-methyl-5,6-dihydro-1H-pyrimidin-6-yl]phenol SMR000132574 | cid_4148491
Type:
Small organic molecule
Emp. Form.:
C20H22N2O3
Mol. Mass.:
338.4003
SMILES:
CCC1(C)NC(CC(=N1)c1ccc2OCOc2c1)c1ccccc1O
: