Target
Cytochrome P450 11B2, mitochondrial
Ligand
BDBM279728
Substrate
Meas. Tech.
G-402 cell line assay
EC50
0.002±n/a nM
Citation
 Aebi, JAmrein, KEChen, JHornsperger, BKuhn, BLiu, YLi, DMaerki, HPMartin, REMayweg, ATan, XWu, JYu, J Spirodiamine derivatives as aldosterone synthase inhibitors US Patent  US10035804 Publication Date 7/31/2018 
Target
Name:
Cytochrome P450 11B2, mitochondrial
Synonyms:
Aldosterone Synthase (CYP11B2) Aldosterone-synthesizing enzyme CYP11B2 Cytochrome P450 11B2 Cytochrome P450 11B2, mitochondrial P-450C18 | Steroid 18-hydroxylase
Type:
Protein
Mol. Mass.:
57582.15
Organism:
Homo sapiens (Human)
Description:
P19099
Residue:
503
  
Inhibitor
Name:
BDBM279728
Synonyms:
5-Chloro-3,3-dimethyl-2-[5-[2-(1-methylpyrazole-4-carbonyl)-2,6-diazaspiro[3.3]-heptan-6-yl]-3-pyridyl]isoindolin-1-one | US10035804, Example 1
Type:
Small organic molecule
Emp. Form.:
C25H25ClN6O2
Mol. Mass.:
476.958
SMILES:
Cn1cc(cn1)C(=O)N1CC2(C1)CN(C2)c1cncc(c1)N1C(=O)c2ccc(Cl)cc2C1(C)C
: