Target
Cytochrome P450 11B1, mitochondrial
Ligand
BDBM279748
Substrate
Meas. Tech.
G-402 cell line assay
EC50
7.69±n/a nM
Citation
 Aebi, JAmrein, KEChen, JHornsperger, BKuhn, BLiu, YLi, DMaerki, HPMartin, REMayweg, ATan, XWu, JYu, J Spirodiamine derivatives as aldosterone synthase inhibitors US Patent  US10035804 Publication Date 7/31/2018 
Target
Name:
Cytochrome P450 11B1, mitochondrial
Synonyms:
C11B1_HUMAN CYPXIB1 Cytochrome P450 11B1 Cytochrome P450 11B1, mitochondrial | S11BH
Type:
Enzyme
Mol. Mass.:
57591.44
Organism:
Homo sapiens (Human)
Description:
P15538
Residue:
503
  
Inhibitor
Name:
BDBM279748
Synonyms:
US10035804, Example 19
Type:
Small organic molecule
Emp. Form.:
C25H23ClN6O2
Mol. Mass.:
474.942
SMILES:
Cn1cc(cn1)C(=O)N1CC2(C1)CN(C2)c1cncc(c1)N1C(=O)c2ccc(Cl)cc2C11CC1
: