Target
Cytochrome P450 11B1, mitochondrial
Ligand
BDBM279765
Substrate
Meas. Tech.
G-402 cell line assay
EC50
31.0±n/a nM
Citation
 Aebi, JAmrein, KEChen, JHornsperger, BKuhn, BLiu, YLi, DMaerki, HPMartin, REMayweg, ATan, XWu, JYu, J Spirodiamine derivatives as aldosterone synthase inhibitors US Patent  US10035804 Publication Date 7/31/2018 
Target
Name:
Cytochrome P450 11B1, mitochondrial
Synonyms:
C11B1_HUMAN CYPXIB1 Cytochrome P450 11B1 Cytochrome P450 11B1, mitochondrial | S11BH
Type:
Enzyme
Mol. Mass.:
57591.44
Organism:
Homo sapiens (Human)
Description:
P15538
Residue:
503
  
Inhibitor
Name:
BDBM279765
Synonyms:
US10035804, Example 36
Type:
Small organic molecule
Emp. Form.:
C27H23ClN6O2
Mol. Mass.:
498.964
SMILES:
CC1(C)N(C(=O)c2ccc(Cl)cc12)c1cncc(c1)N1CC2(CN(C2)C(=O)c2cncc(c2)C#N)C1
: