Target
Cytochrome P450 11B1, mitochondrial
Ligand
BDBM279780
Substrate
Meas. Tech.
G-402 cell line assay
EC50
13.8±n/a nM
Citation
 Aebi, JAmrein, KEChen, JHornsperger, BKuhn, BLiu, YLi, DMaerki, HPMartin, REMayweg, ATan, XWu, JYu, J Spirodiamine derivatives as aldosterone synthase inhibitors US Patent  US10035804 Publication Date 7/31/2018 
Target
Name:
Cytochrome P450 11B1, mitochondrial
Synonyms:
C11B1_HUMAN CYPXIB1 Cytochrome P450 11B1 Cytochrome P450 11B1, mitochondrial | S11BH
Type:
Enzyme
Mol. Mass.:
57591.44
Organism:
Homo sapiens (Human)
Description:
P15538
Residue:
503
  
Inhibitor
Name:
BDBM279780
Synonyms:
US10035804, Example 51
Type:
Small organic molecule
Emp. Form.:
C25H25ClN6O2
Mol. Mass.:
476.958
SMILES:
CCn1cc(cn1)C(=O)N1CC2(C1)CN(C2)c1cncc(c1)N1[C@@H](C)c2cc(Cl)ccc2C1=O
: