Target
Cytochrome P450 11B1, mitochondrial
Ligand
BDBM279783
Substrate
Meas. Tech.
G-402 cell line assay
EC50
22.0±n/a nM
Citation
 Aebi, JAmrein, KEChen, JHornsperger, BKuhn, BLiu, YLi, DMaerki, HPMartin, REMayweg, ATan, XWu, JYu, J Spirodiamine derivatives as aldosterone synthase inhibitors US Patent  US10035804 Publication Date 7/31/2018 
Target
Name:
Cytochrome P450 11B1, mitochondrial
Synonyms:
C11B1_HUMAN CYPXIB1 Cytochrome P450 11B1 Cytochrome P450 11B1, mitochondrial | S11BH
Type:
Enzyme
Mol. Mass.:
57591.44
Organism:
Homo sapiens (Human)
Description:
P15538
Residue:
503
  
Inhibitor
Name:
BDBM279783
Synonyms:
US10035804, Example 54
Type:
Small organic molecule
Emp. Form.:
C25H25ClN6O2
Mol. Mass.:
476.958
SMILES:
C[C@H]1N(C(=O)c2ccc(Cl)cc12)c1cncc(N2CC3(CN(C3)C(=O)c3cnn(C)c3)C2)c1C
: