Target
ADP-ribosylation factor GTPase-activating protein 1
Ligand
BDBM94669
Substrate
IC50
31990±n/a nM
Citation
 PubChem, PC Fluorescence polarization-based biochemical high throughput dose response screening assay to identify inhibitors of ADP-ribosylation factor GTPase activating protein 1 (ARFGAP1) PubChem Bioassay (2012)[AID] 
Target
Name:
ADP-ribosylation factor GTPase-activating protein 1
Synonyms:
ARFG1_RAT Arfgap1
Type:
Enzyme Catalytic Domain
Mol. Mass.:
45436.38
Organism:
Rattus norvegicus
Description:
gi_21489979
Residue:
415
  
Inhibitor
Name:
BDBM94669
Synonyms:
2-[(2-keto-2-piperidino-ethyl)thio]-7-methyl-pyrido[1,2-a][1,3,5]triazin-4-one 7-methyl-2-(2-oxo-2-piperidin-1-ylethyl)sulfanylpyrido[1,2-a][1,3,5]triazin-4-one MLS001234902 cid_7256698
Type:
Small organic molecule
Emp. Form.:
C15H18N4O2S
Mol. Mass.:
318.394
SMILES:
Cc1ccc2nc(SCC(=O)N3CCCCC3)nc(=O)n2c1
: