Target
Envelope glycoprotein gp160
Ligand
BDBM95261
Substrate
IC50
20978±n/a nM
Citation
 PubChem, PC TRFRET-based biochemical high throughput dose response assay for small molecules that bind to the HIV-1-gp120 binding antibody, PG9 PubChem Bioassay (2012)[AID] 
Target
Name:
Envelope glycoprotein gp160
Synonyms:
ENV_HV1H2 Envelope surface glycoprotein gp160, precursor env
Type:
Mol. Mass.:
97241.93
Organism:
Human immunodeficiency virus type 1 group M subtype B (isolate HXB2)
Description:
Residue:
856
  
Inhibitor
Name:
BDBM95261
Synonyms:
2-(3-Cyano-4-methoxymethyl-6-methyl-2-oxo-2H-pyridin-1-yl)-N-(2,4-dichloro-phenyl)-acetamide 2-[3-cyano-4-(methoxymethyl)-6-methyl-2-oxidanylidene-pyridin-1-yl]-N-(2,4-dichlorophenyl)ethanamide 2-[3-cyano-4-(methoxymethyl)-6-methyl-2-oxopyridin-1-yl]-N-(2,4-dichlorophenyl)acetamide SMR000121341 | cid_1045716
Type:
Small organic molecule
Emp. Form.:
C17H15Cl2N3O3
Mol. Mass.:
380.225
SMILES:
COCc1cc(C)n(CC(=O)Nc2ccc(Cl)cc2Cl)c(=O)c1C#N
: