Target
Envelope glycoprotein gp160
Ligand
BDBM82724
Substrate
IC50
>67031±n/a nM
Citation
 PubChem, PC TRFRET-based biochemical high throughput dose response assay for small molecules that bind to the HIV-1-gp120 binding antibody, PG9 PubChem Bioassay (2012)[AID] 
Target
Name:
Envelope glycoprotein gp160
Synonyms:
ENV_HV1H2 Envelope surface glycoprotein gp160, precursor env
Type:
Mol. Mass.:
97241.93
Organism:
Human immunodeficiency virus type 1 group M subtype B (isolate HXB2)
Description:
Residue:
856
  
Inhibitor
Name:
BDBM82724
Synonyms:
MLS000585398 N-(2-ethylphenyl)-2-[2-(4-methoxyphenyl)-4-oxochromen-6-yl]oxyacetamide N-(2-ethylphenyl)-2-[[2-(4-methoxyphenyl)-4-oxo-1-benzopyran-6-yl]oxy]acetamide SMR000204161 | cid_1191851
Type:
Small organic molecule
Emp. Form.:
C26H23NO5
Mol. Mass.:
429.4645
SMILES:
CCc1ccccc1NC(=O)COc1ccc2oc(cc(=O)c2c1)-c1ccc(OC)cc1
: