Target
Envelope glycoprotein gp160
Ligand
BDBM61257
Substrate
IC50
>67054±n/a nM
Citation
 PubChem, PC TRFRET-based biochemical high throughput dose response assay for small molecules that bind to the HIV-1-gp120 binding antibody, PG9 PubChem Bioassay (2012)[AID] 
Target
Name:
Envelope glycoprotein gp160
Synonyms:
ENV_HV1H2 Envelope surface glycoprotein gp160, precursor env
Type:
Mol. Mass.:
97241.93
Organism:
Human immunodeficiency virus type 1 group M subtype B (isolate HXB2)
Description:
Residue:
856
  
Inhibitor
Name:
BDBM61257
Synonyms:
2-(2-keto-4-propyl-chromen-7-yl)oxy-N-(4-sulfamoylphenyl)acetamide 2-(2-oxo-4-propylchromen-7-yl)oxy-N-(4-sulfamoylphenyl)acetamide MLS001159997 cid_8034406
Type:
Small organic molecule
Emp. Form.:
C20H20N2O6S
Mol. Mass.:
416.448
SMILES:
CCCc1cc(=O)oc2cc(OCC(=O)Nc3ccc(cc3)S(N)(=O)=O)ccc12
: