Target
Envelope glycoprotein gp160
Ligand
BDBM95265
Substrate
IC50
4170±n/a nM
Citation
 PubChem, PC Counterscreen for discovery of small molecules that bind to the HIV-1-gp120 binding antibody, PG9 PubChem Bioassay (2012)[AID] 
Target
Name:
Envelope glycoprotein gp160
Synonyms:
ENV_HV1H2 Envelope surface glycoprotein gp160, precursor env
Type:
Mol. Mass.:
97241.93
Organism:
Human immunodeficiency virus type 1 group M subtype B (isolate HXB2)
Description:
Residue:
856
  
Inhibitor
Name:
BDBM95265
Synonyms:
2-(4-morpholinophenyl)quinoline 4-[4-(2-quinolinyl)phenyl]morpholine MLS000547365 cid_1472976
Type:
Small organic molecule
Emp. Form.:
C19H18N2O
Mol. Mass.:
290.359
SMILES:
C1CN(CCO1)c1ccc(cc1)-c1ccc2ccccc2n1
: