Target
Envelope glycoprotein gp160
Ligand
BDBM95275
Substrate
IC50
>67043±n/a nM
Citation
 PubChem, PC Counterscreen for discovery of small molecules that bind to the HIV-1-gp120 binding antibody, PG9 PubChem Bioassay (2012)[AID] 
Target
Name:
Envelope glycoprotein gp160
Synonyms:
ENV_HV1H2 Envelope surface glycoprotein gp160, precursor env
Type:
Mol. Mass.:
97241.93
Organism:
Human immunodeficiency virus type 1 group M subtype B (isolate HXB2)
Description:
Residue:
856
  
Inhibitor
Name:
BDBM95275
Synonyms:
4-acetyl-N-[3-[(2-methoxyphenyl)sulfamoyl]phenyl]-3,5-dimethyl-1H-pyrrole-2-carboxamide MLS000761303 cid_3434681
Type:
Small organic molecule
Emp. Form.:
C22H23N3O5S
Mol. Mass.:
441.5
SMILES:
COc1ccccc1NS(=O)(=O)c1cccc(NC(=O)c2[nH]c(C)c(C(C)=O)c2C)c1
: