Target
Envelope glycoprotein gp160
Ligand
BDBM95283
Substrate
IC50
12069±n/a nM
Citation
 PubChem, PC Counterscreen for discovery of small molecules that bind to the HIV-1-gp120 binding antibody, PG9 PubChem Bioassay (2012)[AID] 
Target
Name:
Envelope glycoprotein gp160
Synonyms:
ENV_HV1H2 Envelope surface glycoprotein gp160, precursor env
Type:
Mol. Mass.:
97241.93
Organism:
Human immunodeficiency virus type 1 group M subtype B (isolate HXB2)
Description:
Residue:
856
  
Inhibitor
Name:
BDBM95283
Synonyms:
2,4-dimethoxy-N-[5-(phenylmethyl)-1,3,4-thiadiazol-2-yl]benzamide N-(5-Benzyl-[1,3,4]thiadiazol-2-yl)-2,4-dimethoxy-benzamide N-(5-benzyl-1,3,4-thiadiazol-2-yl)-2,4-dimethoxybenzamide cid_1086869
Type:
Small organic molecule
Emp. Form.:
C18H17N3O3S
Mol. Mass.:
355.411
SMILES:
COc1ccc(C(=O)Nc2nnc(Cc3ccccc3)s2)c(OC)c1
: