Target
Envelope glycoprotein gp160
Ligand
BDBM95307
Substrate
IC50
1723±n/a nM
Citation
 PubChem, PC Counterscreen for discovery of small molecules that bind to the HIV-1-gp120 binding antibody, PG9 PubChem Bioassay (2012)[AID] 
Target
Name:
Envelope glycoprotein gp160
Synonyms:
ENV_HV1H2 Envelope surface glycoprotein gp160, precursor env
Type:
Mol. Mass.:
97241.93
Organism:
Human immunodeficiency virus type 1 group M subtype B (isolate HXB2)
Description:
Residue:
856
  
Inhibitor
Name:
BDBM95307
Synonyms:
2-(4-Butyl-2,3-dihydro-1H-6-thia-5,8,10-triaza-cyclopenta[c]fluoren-7-ylsulfanyl)-N-furan-2-ylmethyl-acet amide SMR000147385 | cid_1943710
Type:
Small organic molecule
Emp. Form.:
C23H24N4O2S2
Mol. Mass.:
452.592
SMILES:
CCCCc1nc2sc3c(SCC(=O)NCc4ccco4)ncnc3c2c2CCCc12
: