Target
Mitochondrial peptide methionine sulfoxide reductase
Ligand
BDBM33185
Substrate
IC50
6416±n/a nM
Citation
 PubChem, PC Absorbance-based biochemical high throughput dose response assay to identify inhibitors of Methionine sulfoxide reductase A (MsrA) PubChem Bioassay (2013)[AID] 
Target
Name:
Mitochondrial peptide methionine sulfoxide reductase
Synonyms:
MSRA MSRA_BOVIN
Type:
Enzyme Catalytic Domain
Mol. Mass.:
25822.90
Organism:
Bos taurus
Description:
gi_73586699
Residue:
233
  
Inhibitor
Name:
BDBM33185
Synonyms:
4-({(4Z)-1-oxo-4-[(phenylsulfonyl)imino]-1,4-dihydronaphthalen-2-yl}amino)benzoic acid 4-[[(4Z)-4-besylimino-1-keto-2-naphthyl]amino]benzoic acid 4-[[4-(benzenesulfonylimino)-1-oxo-2-naphthalenyl]amino]benzoic acid MLS000686314 cid_4053104
Type:
Small organic molecule
Emp. Form.:
C23H16N2O5S
Mol. Mass.:
432.449
SMILES:
OC(=O)c1ccc(NC2=CC(=NS(=O)(=O)c3ccccc3)c3ccccc3C2=O)cc1
: