Target
Neutrophil elastase
Ligand
BDBM405417
Substrate
Meas. Tech.
Enzyme Inhibition Assay
IC50
<1.000±n/a nM
Citation
 Gnamm, COost, TPeters, SRudolf, K Substituted bicyclic dihydropyrimidinones and their use as inhibitors of neutrophil elastase activity US Patent  USRE47493 Publication Date 7/9/2019 
Target
Name:
Neutrophil elastase
Synonyms:
Bone marrow serine protease Coagulation factor X ELANE Elastase HLE Leukocyte elastase Medullasin Neutrophil elastase (HNE) PMN elastase Trypsin
Type:
Enzyme
Mol. Mass.:
28532.38
Organism:
Homo sapiens (Human)
Description:
P08246
Residue:
267
  
Inhibitor
Name:
BDBM405417
Synonyms:
USRE47493, Example 39.5
Type:
Small organic molecule
Emp. Form.:
C26H21F3N4O4
Mol. Mass.:
510.4645
SMILES:
FC(F)(F)c1cccc(c1)N1C(=O)N(C(C2=C1CCCC2=O)c1ccc(cc1)C#N)C(=O)NC1COC1
: