Target
Neutrophil elastase
Ligand
BDBM405535
Substrate
Meas. Tech.
Enzyme Inhibition Assay
IC50
<1.000±n/a nM
Citation
 Gnamm, COost, TPeters, SRudolf, K Substituted bicyclic dihydropyrimidinones and their use as inhibitors of neutrophil elastase activity US Patent  USRE47493 Publication Date 7/9/2019 
Target
Name:
Neutrophil elastase
Synonyms:
Bone marrow serine protease Coagulation factor X ELANE Elastase HLE Leukocyte elastase Medullasin Neutrophil elastase (HNE) PMN elastase Trypsin
Type:
Enzyme
Mol. Mass.:
28532.38
Organism:
Homo sapiens (Human)
Description:
P08246
Residue:
267
  
Inhibitor
Name:
BDBM405535
Synonyms:
USRE47493, Example 75.8
Type:
Small organic molecule
Emp. Form.:
C28H24F3N5O5S
Mol. Mass.:
599.581
SMILES:
CS(O)(O)c1cc(ccc1[C@H]1N(C(=O)NC2(CC2)C#N)C(=O)N(C2=C1C(=O)CCC2)c1cccc(c1)C(F)(F)F)C#N
: