Target
Nuclear receptor subfamily 5 group A member 2
Ligand
BDBM95470
Substrate
IC50
>11964±n/a nM
Citation
 PubChem, PC Luminescence-based cell-based high throughput dose response assay for inverse agonists of the liver receptor homolog-1 (LRH-1; NR5A2) PubChem Bioassay (2013)[AID] 
Target
Name:
Nuclear receptor subfamily 5 group A member 2
Synonyms:
Alpha-1-fetoprotein transcription factor B1F CYP7A promoter-binding factor Hepatocytic transcription factor Liver Receptor Homolog 1 NR5A2_HUMAN hB1F | nuclear receptor subfamily 5 group A member 2 isoform 2
Type:
Nuclear Hormone Receptor
Mol. Mass.:
61341.37
Organism:
Homo sapiens (Human)
Description:
Residue:
541
  
Inhibitor
Name:
BDBM95470
Synonyms:
(2S)-2-[5-[[2-(2-ethylanilino)-2-keto-ethyl]thio]-1,3,4-oxadiazol-2-yl]pyrrolidine-1-carboxylic acid tert-butyl ester MLS000041920 cid_665749 tert-butyl (2S)-2-[5-[2-[(2-ethylphenyl)amino]-2-oxidanylidene-ethyl]sulfanyl-1,3,4-oxadiazol-2-yl]pyrrolidine-1-carboxylate
Type:
Small organic molecule
Emp. Form.:
C21H28N4O4S
Mol. Mass.:
432.536
SMILES:
CCc1ccccc1NC(=O)CSc1nnc(o1)[C@@H]1CCCN1C(=O)OC(C)(C)C
: