Target
Nuclear receptor subfamily 5 group A member 2
Ligand
BDBM95474
Substrate
IC50
4023±n/a nM
Citation
 PubChem, PC Luminescence-based cell-based high throughput dose response assay for inverse agonists of the liver receptor homolog-1 (LRH-1; NR5A2) PubChem Bioassay (2013)[AID] 
Target
Name:
Nuclear receptor subfamily 5 group A member 2
Synonyms:
Alpha-1-fetoprotein transcription factor B1F CYP7A promoter-binding factor Hepatocytic transcription factor Liver Receptor Homolog 1 NR5A2_HUMAN hB1F | nuclear receptor subfamily 5 group A member 2 isoform 2
Type:
Nuclear Hormone Receptor
Mol. Mass.:
61341.37
Organism:
Homo sapiens (Human)
Description:
Residue:
541
  
Inhibitor
Name:
BDBM95474
Synonyms:
MLS000047465 N-(2,3-dihydro-1,4-benzodioxin-6-yl)-2-[4-[2-(2-methoxyanilino)-2-oxoethyl]piperazin-1-yl]acetamide N-(2,3-dihydro-1,4-benzodioxin-6-yl)-2-[4-[2-keto-2-(o-anisidino)ethyl]piperazino]acetamide cid_3245185
Type:
Small organic molecule
Emp. Form.:
C23H28N4O5
Mol. Mass.:
440.4922
SMILES:
COc1ccccc1NC(=O)CN1CCN(CC(=O)Nc2ccc3OCCOc3c2)CC1
: