Target
Nuclear receptor subfamily 5 group A member 2
Ligand
BDBM87675
Substrate
IC50
17562±n/a nM
Citation
 PubChem, PC Luminescence-based cell-based high throughput dose response assay for inverse agonists of the liver receptor homolog-1 (LRH-1; NR5A2) PubChem Bioassay (2013)[AID] 
Target
Name:
Nuclear receptor subfamily 5 group A member 2
Synonyms:
Alpha-1-fetoprotein transcription factor B1F CYP7A promoter-binding factor Hepatocytic transcription factor Liver Receptor Homolog 1 NR5A2_HUMAN hB1F | nuclear receptor subfamily 5 group A member 2 isoform 2
Type:
Nuclear Hormone Receptor
Mol. Mass.:
61341.37
Organism:
Homo sapiens (Human)
Description:
Residue:
541
  
Inhibitor
Name:
BDBM87675
Synonyms:
MLS000091597 N-[[5-[2-(2,3-dihydro-1,4-benzodioxin-6-ylamino)-2-oxidanylidene-ethyl]sulfanyl-1,3,4-oxadiazol-2-yl]methyl]-2-fluoranyl-benzamide N-[[5-[[2-(2,3-dihydro-1,4-benzodioxin-6-ylamino)-2-keto-ethyl]thio]-1,3,4-oxadiazol-2-yl]methyl]-2-fluoro-benzamide SMR000026147 | cid_3245562
Type:
Small organic molecule
Emp. Form.:
C20H17FN4O5S
Mol. Mass.:
444.436
SMILES:
Fc1ccccc1C(=O)NCc1nnc(SCC(=O)Nc2ccc3OCCOc3c2)o1
: