Target
Nuclear receptor subfamily 5 group A member 2
Ligand
BDBM95477
Substrate
IC50
14584±n/a nM
Citation
 PubChem, PC Luminescence-based cell-based high throughput dose response assay for inverse agonists of the liver receptor homolog-1 (LRH-1; NR5A2) PubChem Bioassay (2013)[AID] 
Target
Name:
Nuclear receptor subfamily 5 group A member 2
Synonyms:
Alpha-1-fetoprotein transcription factor B1F CYP7A promoter-binding factor Hepatocytic transcription factor Liver Receptor Homolog 1 NR5A2_HUMAN hB1F | nuclear receptor subfamily 5 group A member 2 isoform 2
Type:
Nuclear Hormone Receptor
Mol. Mass.:
61341.37
Organism:
Homo sapiens (Human)
Description:
Residue:
541
  
Inhibitor
Name:
BDBM95477
Synonyms:
3,4,5-trimethoxy-N-[2-(4-methylsulfonyl-1-piperazinyl)phenyl]benzamide 3,4,5-trimethoxy-N-{2-[4-(methylsulfonyl)-1-piperazinyl]phenyl}benzamide N-[2-(4-mesylpiperazino)phenyl]-3,4,5-trimethoxy-benzamide cid_1954059
Type:
Small organic molecule
Emp. Form.:
C21H27N3O6S
Mol. Mass.:
449.521
SMILES:
COc1cc(cc(OC)c1OC)C(=O)Nc1ccccc1N1CCN(CC1)S(C)(=O)=O
: