Target
Nuclear receptor subfamily 5 group A member 2
Ligand
BDBM95534
Substrate
IC50
2315±n/a nM
Citation
 PubChem, PC Luminescence-based cell-based high throughput dose response assay for inverse agonists of the liver receptor homolog-1 (LRH-1; NR5A2) PubChem Bioassay (2013)[AID] 
Target
Name:
Nuclear receptor subfamily 5 group A member 2
Synonyms:
Alpha-1-fetoprotein transcription factor B1F CYP7A promoter-binding factor Hepatocytic transcription factor Liver Receptor Homolog 1 NR5A2_HUMAN hB1F | nuclear receptor subfamily 5 group A member 2 isoform 2
Type:
Nuclear Hormone Receptor
Mol. Mass.:
61341.37
Organism:
Homo sapiens (Human)
Description:
Residue:
541
  
Inhibitor
Name:
BDBM95534
Synonyms:
2-(2-azanylidene-1,3-thiazol-3-yl)-N-(4-sulfamoylphenyl)ethanamide;hydrochloride 2-(2-imino-3-thiazolyl)-N-(4-sulfamoylphenyl)acetamide;hydrochloride MLS001002470 cid_16244818
Type:
Small organic molecule
Emp. Form.:
C11H12N4O3S2
Mol. Mass.:
312.368
SMILES:
NS(=O)(=O)c1ccc(NC(=O)Cn2ccsc2=N)cc1
: