Target
Telomerase protein component 1
Ligand
BDBM279798
Substrate
Meas. Tech.
Primer Extension Assay
pH
8.5±n/a
EC50
4400±n/a nM
Comments
extracted
Citation
 Gryaznov, SMPruzan, RAPongracz, K Guanine analogs as telomerase substrates and telomere length affectors US Patent  US10035814 Publication Date 7/31/2018 
Target
Name:
Telomerase protein component 1
Synonyms:
TEP1 TLP1 Telomerase protein 1 p240 | p80 telomerase homolog
Type:
Mol. Mass.:
290540.98
Organism:
Homo sapiens (Human)
Description:
Q99973
Residue:
2627
  
Inhibitor
Name:
BDBM279798
Synonyms:
PMIBaG (mix R,S) | US10035814, Compound 142846
Type:
Small organic molecule
Emp. Form.:
C10H18N5O11P3
Mol. Mass.:
477.1981
SMILES:
CC(COCP(O)(=O)OP(O)(=O)OP(O)(O)=O)Cn1cnc2c1nc(N)[nH]c2=O
: