Target
Telomerase protein component 1
Ligand
BDBM279805
Substrate
Meas. Tech.
Ex-Vivo Assay
EC50
6700±n/a nM
Citation
 Gryaznov, SMPruzan, RAPongracz, K Guanine analogs as telomerase substrates and telomere length affectors US Patent  US10035814 Publication Date 7/31/2018 
Target
Name:
Telomerase protein component 1
Synonyms:
TEP1 TLP1 Telomerase protein 1 p240 | p80 telomerase homolog
Type:
Mol. Mass.:
290540.98
Organism:
Homo sapiens (Human)
Description:
Q99973
Residue:
2627
  
Inhibitor
Name:
BDBM279805
Synonyms:
PMIBeG spermidine | US10035814, Compound 142873
Type:
Small organic molecule
Emp. Form.:
C17H31N8O4P
Mol. Mass.:
442.453
SMILES:
NCCCCNCCCNP(O)(=O)COCC(=C)Cn1cnc2c1nc(N)[nH]c2=O
: