Target
Tumor necrosis factor receptor superfamily member 10B
Ligand
BDBM95895
Substrate
EC50
>12500±n/a nM
Citation
 PubChem, PC Dose Response confirmation of uHTS hits for a small molecule Caspase-8 TRAIL sensitizers in a luminescence panel assay PubChem Bioassay (2013)[AID] 
Target
Name:
Tumor necrosis factor receptor superfamily member 10B
Synonyms:
DR5 TNFRSF10B TRAILR2 ZTNFR9 | tumor necrosis factor receptor superfamily member 10B isoform 1 precursor [Homo sapiens]
Type:
Enzyme Catalytic Domain
Mol. Mass.:
47869.76
Organism:
Homo sapiens (Human)
Description:
gi_224494019
Residue:
440
  
Inhibitor
Name:
BDBM95895
Synonyms:
4-[(E)-3-(2-Methoxy-phenyl)-prop-2-en-(E)-ylideneamino]-5-(5-phenyl-2H-pyrazol-3-yl)-4H-[1,2,4]triazol e-3-thiol MLS000762685 cid_6868524
Type:
Small organic molecule
Emp. Form.:
C21H18N6OS
Mol. Mass.:
402.472
SMILES:
COc1ccccc1C=CC=Nn1c(n[nH]c1=S)-c1cc([nH]n1)-c1ccccc1
: