Target
Tumor necrosis factor receptor superfamily member 10B
Ligand
BDBM95899
Substrate
EC50
10800±n/a nM
Citation
 PubChem, PC Dose Response confirmation of uHTS hits for a small molecule Caspase-8 TRAIL sensitizers in a luminescence panel assay PubChem Bioassay (2013)[AID] 
Target
Name:
Tumor necrosis factor receptor superfamily member 10B
Synonyms:
DR5 TNFRSF10B TRAILR2 ZTNFR9 | tumor necrosis factor receptor superfamily member 10B isoform 1 precursor [Homo sapiens]
Type:
Enzyme Catalytic Domain
Mol. Mass.:
47869.76
Organism:
Homo sapiens (Human)
Description:
gi_224494019
Residue:
440
  
Inhibitor
Name:
BDBM95899
Synonyms:
1-(4-acetylphenyl)-3-(3-pyridinyl)urea 1-(4-acetylphenyl)-3-pyridin-3-ylurea MLS001230229 cid_24819596
Type:
Small organic molecule
Emp. Form.:
C14H13N3O2
Mol. Mass.:
255.2719
SMILES:
CC(=O)c1ccc(NC(=O)Nc2cccnc2)cc1
: