Target
Tumor necrosis factor receptor superfamily member 10B
Ligand
BDBM48251
Substrate
EC50
>12500±n/a nM
Citation
 PubChem, PC Dose Response confirmation of uHTS hits for a small molecule Caspase-8 TRAIL sensitizers in a luminescence panel assay PubChem Bioassay (2013)[AID] 
Target
Name:
Tumor necrosis factor receptor superfamily member 10B
Synonyms:
DR5 TNFRSF10B TRAILR2 ZTNFR9 | tumor necrosis factor receptor superfamily member 10B isoform 1 precursor [Homo sapiens]
Type:
Enzyme Catalytic Domain
Mol. Mass.:
47869.76
Organism:
Homo sapiens (Human)
Description:
gi_224494019
Residue:
440
  
Inhibitor
Name:
BDBM48251
Synonyms:
(E)-3-(3-hydroxyanilino)-1-(4-methoxyphenyl)-2-propen-1-one (E)-3-[(3-hydroxyphenyl)amino]-1-(4-methoxyphenyl)prop-2-en-1-one MLS000530961 cid_2291052
Type:
Small organic molecule
Emp. Form.:
C16H15NO3
Mol. Mass.:
269.2952
SMILES:
COc1ccc(cc1)C(=O)CC=Nc1cccc(O)c1
: