Target
Tumor necrosis factor receptor superfamily member 10B
Ligand
BDBM95975
Substrate
EC50
6010±n/a nM
Citation
 PubChem, PC Dose Response confirmation of uHTS hits for a small molecule Caspase-8 TRAIL sensitizers in a luminescence panel assay PubChem Bioassay (2013)[AID] 
Target
Name:
Tumor necrosis factor receptor superfamily member 10B
Synonyms:
DR5 TNFRSF10B TRAILR2 ZTNFR9 | tumor necrosis factor receptor superfamily member 10B isoform 1 precursor [Homo sapiens]
Type:
Enzyme Catalytic Domain
Mol. Mass.:
47869.76
Organism:
Homo sapiens (Human)
Description:
gi_224494019
Residue:
440
  
Inhibitor
Name:
BDBM95975
Synonyms:
MLS001180650 N-(6-ethoxy-1,3-benzothiazol-2-yl)-5-methyl-2-furancarboxamide N-(6-ethoxy-1,3-benzothiazol-2-yl)-5-methylfuran-2-carboxamide cid_844341
Type:
Small organic molecule
Emp. Form.:
C15H14N2O3S
Mol. Mass.:
302.348
SMILES:
CCOc1ccc2nc(NC(=O)c3ccc(C)o3)sc2c1
: