Target
Tumor necrosis factor receptor superfamily member 10B
Ligand
BDBM48191
Substrate
EC50
4220±n/a nM
Citation
 PubChem, PC Dose Response confirmation of uHTS hits for a small molecule Caspase-8 TRAIL sensitizers in a luminescence panel assay PubChem Bioassay (2013)[AID] 
Target
Name:
Tumor necrosis factor receptor superfamily member 10B
Synonyms:
DR5 TNFRSF10B TRAILR2 ZTNFR9 | tumor necrosis factor receptor superfamily member 10B isoform 1 precursor [Homo sapiens]
Type:
Enzyme Catalytic Domain
Mol. Mass.:
47869.76
Organism:
Homo sapiens (Human)
Description:
gi_224494019
Residue:
440
  
Inhibitor
Name:
BDBM48191
Synonyms:
MLS000112021 N-(4,5-dihydro-1,3-thiazol-2-yl)-1-benzofuran-2-carboxamide SMR000107939 | cid_796559
Type:
Small organic molecule
Emp. Form.:
C12H10N2O2S
Mol. Mass.:
246.285
SMILES:
O=C(NC1=NCCS1)c1cc2ccccc2o1
: