Target
Low molecular weight phosphotyrosine protein phosphatase
Ligand
BDBM30786
Substrate
IC50
>80000±n/a nM
Citation
 PubChem, PC Dose response confirmation of small molecule inhibitors of Low Molecular Weight Protein Tyrosine Phosphatase, LMPTP, in an orthogonal absorbance-based assay PubChem Bioassay (2013)[AID] 
Target
Name:
Low molecular weight phosphotyrosine protein phosphatase
Synonyms:
3.1.3.2 ACP1 LMW-PTP LMWPTP PPAC_HUMAN low molecular weight phosphotyrosine protein phosphatase isoform c
Type:
Mol. Mass.:
18042.81
Organism:
Homo sapiens (Human)
Description:
P24666
Residue:
158
  
Inhibitor
Name:
BDBM30786
Synonyms:
1-(4-chlorobenzyl)-N-(2-furfuryl)-2-imino-5-keto-dipyrido[1,2-d:3',4'-f]pyrimidine-3-carboxamide 1-[(4-chlorophenyl)methyl]-N-(furan-2-ylmethyl)-2-imino-5-oxodipyrido[1,2-d:3',4'-f]pyrimidine-3-carboxamide MLS000083283 cid_666486
Type:
Small organic molecule
Emp. Form.:
C24H18ClN5O3
Mol. Mass.:
459.884
SMILES:
Clc1ccc(Cn2c3nc4ccccn4c(=O)c3cc(C(=O)NCc3ccco3)c2=N)cc1
: