Target
Low molecular weight phosphotyrosine protein phosphatase
Ligand
BDBM94910
Substrate
IC50
14000±n/a nM
Citation
 PubChem, PC Dose response confirmation of small molecule inhibitors of Low Molecular Weight Protein Tyrosine Phosphatase, LMPTP, in an orthogonal absorbance-based assay PubChem Bioassay (2013)[AID] 
Target
Name:
Low molecular weight phosphotyrosine protein phosphatase
Synonyms:
3.1.3.2 ACP1 LMW-PTP LMWPTP PPAC_HUMAN low molecular weight phosphotyrosine protein phosphatase isoform c
Type:
Mol. Mass.:
18042.81
Organism:
Homo sapiens (Human)
Description:
P24666
Residue:
158
  
Inhibitor
Name:
BDBM94910
Synonyms:
2-phenyl-4-(1-piperidinyl)quinoline 2-phenyl-4-piperidin-1-ylquinoline MLS000729043 cid_1504001
Type:
Small organic molecule
Emp. Form.:
C20H20N2
Mol. Mass.:
288.3862
SMILES:
C1CCN(CC1)c1cc(nc2ccccc12)-c1ccccc1
: