Target
Low molecular weight phosphotyrosine protein phosphatase
Ligand
BDBM82795
Substrate
IC50
35000±n/a nM
Citation
 PubChem, PC Dose response confirmation of small molecule inhibitors of Low Molecular Weight Protein Tyrosine Phosphatase, LMPTP, in an orthogonal absorbance-based assay PubChem Bioassay (2013)[AID] 
Target
Name:
Low molecular weight phosphotyrosine protein phosphatase
Synonyms:
3.1.3.2 ACP1 LMW-PTP LMWPTP PPAC_HUMAN low molecular weight phosphotyrosine protein phosphatase isoform c
Type:
Mol. Mass.:
18042.81
Organism:
Homo sapiens (Human)
Description:
P24666
Residue:
158
  
Inhibitor
Name:
BDBM82795
Synonyms:
4-[(4-{2-cyano-3-[(4-methoxyphenyl)amino]-3-oxo-1-propen-1-yl}-2-methoxyphenoxy)methyl]benzoic acid 4-[[4-[(Z)-2-cyano-3-[(4-methoxyphenyl)amino]-3-oxidanylidene-prop-1-enyl]-2-methoxy-phenoxy]methyl]benzoic acid MLS000673878 cid_2208545
Type:
Small organic molecule
Emp. Form.:
C26H22N2O6
Mol. Mass.:
458.4627
SMILES:
COc1ccc(NC(=O)C(=C/c2ccc(OCc3ccc(cc3)C(O)=O)c(OC)c2)\C#N)cc1
: