Target
Low molecular weight phosphotyrosine protein phosphatase
Ligand
BDBM94988
Substrate
IC50
8330±n/a nM
Citation
 PubChem, PC Dose response confirmation of small molecule inhibitors of Low Molecular Weight Protein Tyrosine Phosphatase, LMPTP, in an orthogonal absorbance-based assay PubChem Bioassay (2013)[AID] 
Target
Name:
Low molecular weight phosphotyrosine protein phosphatase
Synonyms:
3.1.3.2 ACP1 LMW-PTP LMWPTP PPAC_HUMAN low molecular weight phosphotyrosine protein phosphatase isoform c
Type:
Mol. Mass.:
18042.81
Organism:
Homo sapiens (Human)
Description:
P24666
Residue:
158
  
Inhibitor
Name:
BDBM94988
Synonyms:
MLS000830187 N-(7-methyl-4-oxidanylidene-thieno[3,2-d][1,3]thiazin-2-yl)thiophene-2-carboxamide N-(7-methyl-4-oxo-4H-thieno[3,2-d][1,3]thiazin-2-yl)thiophene-2-carboxamide SMR000458108 | cid_2810073
Type:
Small organic molecule
Emp. Form.:
C12H8N2O2S3
Mol. Mass.:
308.399
SMILES:
Cc1csc2c1nc(NC(=O)c1cccs1)sc2=O
: