Target
Low molecular weight phosphotyrosine protein phosphatase
Ligand
BDBM48754
Substrate
IC50
2890±n/a nM
Citation
 PubChem, PC Dose response confirmation of small molecule inhibitors of Low Molecular Weight Protein Tyrosine Phosphatase, LMPTP, in an orthogonal absorbance-based assay PubChem Bioassay (2013)[AID] 
Target
Name:
Low molecular weight phosphotyrosine protein phosphatase
Synonyms:
3.1.3.2 ACP1 LMW-PTP LMWPTP PPAC_HUMAN low molecular weight phosphotyrosine protein phosphatase isoform c
Type:
Mol. Mass.:
18042.81
Organism:
Homo sapiens (Human)
Description:
P24666
Residue:
158
  
Inhibitor
Name:
BDBM48754
Synonyms:
2-(2-chlorophenyl)-N'-(2-keto-5-nitro-indol-3-yl)cinchoninohydrazide 2-(2-chlorophenyl)-N'-(5-nitro-2-oxo-3-indolyl)-4-quinolinecarbohydrazide MLS000374708 cid_6283541
Type:
Small organic molecule
Emp. Form.:
C24H14ClN5O4
Mol. Mass.:
471.852
SMILES:
[O-][N+](=O)c1ccc2[N-]C(=O)\C(=[NH+]/NC(=O)c3cc(nc4ccccc34)-c3ccccc3Cl)c2c1
: