Target
Tyrosine-protein phosphatase non-receptor type 22
Ligand
BDBM95049
Substrate
IC50
>80000±n/a nM
Citation
 PubChem, PC Dose response confirmation of small molecule inhibitors of Low Molecular Weight Protein Tyrosine Phosphatase, LMPTP, in a fluorescence-based, Lymphoid Phosphatase (PTPN22, LYP-1) selectivity Assay PubChem Bioassay (2013)[AID] 
Target
Name:
Tyrosine-protein phosphatase non-receptor type 22
Synonyms:
3.1.3.48 LyP Lymphoid phosphatase (Lyp) PEST-domain phosphatase PTPN22 Tyrosine-protein phosphatase non-receptor type 22 (LYP) | tyrosine-protein phosphatase non-receptor type 22 isoform 1
Type:
Mol. Mass.:
91712.31
Organism:
Homo sapiens (Human)
Description:
Q9Y2R2
Residue:
807
  
Inhibitor
Name:
BDBM95049
Synonyms:
(3-Morpholin-4-yl-propyl)-(2-m-tolyl-quinazolin-4-yl)-amine 2-(3-methylphenyl)-N-[3-(4-morpholinyl)propyl]-4-quinazolinamine MLS000527359 cid_1566769
Type:
Small organic molecule
Emp. Form.:
C22H26N4O
Mol. Mass.:
362.468
SMILES:
Cc1cccc(c1)-c1nc(NCCCN2CCOCC2)c2ccccc2n1
: