Target
Tyrosine-protein phosphatase non-receptor type 22
Ligand
BDBM94890
Substrate
IC50
42200±n/a nM
Citation
 PubChem, PC Dose response confirmation of small molecule inhibitors of Low Molecular Weight Protein Tyrosine Phosphatase, LMPTP, in a fluorescence-based, Lymphoid Phosphatase (PTPN22, LYP-1) selectivity Assay PubChem Bioassay (2013)[AID] 
Target
Name:
Tyrosine-protein phosphatase non-receptor type 22
Synonyms:
3.1.3.48 LyP Lymphoid phosphatase (Lyp) PEST-domain phosphatase PTPN22 Tyrosine-protein phosphatase non-receptor type 22 (LYP) | tyrosine-protein phosphatase non-receptor type 22 isoform 1
Type:
Mol. Mass.:
91712.31
Organism:
Homo sapiens (Human)
Description:
Q9Y2R2
Residue:
807
  
Inhibitor
Name:
BDBM94890
Synonyms:
1,3-Dimethyl-5,6-dinitro-2-[3-(1,3,3-trimethyl-1,3-dihydro-indol-2-ylidene)-propenyl]-3H-benzoimidazol-1-ium 1,3-dimethyl-5,6-dinitro-2-[(E,3E)-3-(1,3,3-trimethylindol-2-ylidene)prop-1-enyl]benzimidazol-3-ium;4-methylbenzenesulfonate MLS001210139 cid_56603498
Type:
Small organic molecule
Emp. Form.:
C23H24N5O4
Mol. Mass.:
434.4672
SMILES:
CN1\C(=C\C=C\c2n(C)c3cc(c(cc3[n+]2C)[N+]([O-])=O)[N+]([O-])=O)C(C)(C)c2ccccc12
: