Target
Fructose-bisphosphate aldolase
Ligand
BDBM96104
Substrate
IC50
1481±n/a nM
Citation
 PubChem, PC Fluorescence-based biochemical high throughput dose response assay for inhibitors of the fructose-bisphosphate aldolase (FBA) of M. tuberculosis PubChem Bioassay (2013)[AID] 
Target
Name:
Fructose-bisphosphate aldolase
Synonyms:
ALF_MYCTU FBPA Fructose-1,6-bisphosphate aldolase (FBA) Probable fructose-bisphosphate aldolase Fba | fba
Type:
Protein
Mol. Mass.:
36539.01
Organism:
Mycobacterium tuberculosis (strain H37Rv)
Description:
P9WQA3
Residue:
344
  
Inhibitor
Name:
BDBM96104
Synonyms:
1-methyl-2-(2-thienyl)benzimidazole 1-methyl-2-thiophen-2-ylbenzimidazole SMR000291293 | cid_931177
Type:
Small organic molecule
Emp. Form.:
C12H10N2S
Mol. Mass.:
214.286
SMILES:
Cn1c(nc2ccccc12)-c1cccs1
: