Target
Fructose-bisphosphate aldolase
Ligand
BDBM96143
Substrate
IC50
>1111±n/a nM
Citation
 PubChem, PC Fluorescence-based biochemical high throughput dose response assay for inhibitors of the fructose-bisphosphate aldolase (FBA) of M. tuberculosis PubChem Bioassay (2013)[AID] 
Target
Name:
Fructose-bisphosphate aldolase
Synonyms:
ALF_MYCTU FBPA Fructose-1,6-bisphosphate aldolase (FBA) Probable fructose-bisphosphate aldolase Fba | fba
Type:
Protein
Mol. Mass.:
36539.01
Organism:
Mycobacterium tuberculosis (strain H37Rv)
Description:
P9WQA3
Residue:
344
  
Inhibitor
Name:
BDBM96143
Synonyms:
5-methyl-4-(7-methyl-2-imidazo[1,2-a]pyridinyl)isoxazole 5-methyl-4-(7-methylimidazo[1,2-a]pyridin-2-yl)isoxazole MLS000540944 cid_1488778
Type:
Small organic molecule
Emp. Form.:
C12H11N3O
Mol. Mass.:
213.2352
SMILES:
Cc1oncc1-c1cn2ccc(C)cc2n1
: