Target
Fructose-bisphosphate aldolase
Ligand
BDBM96150
Substrate
IC50
1475±n/a nM
Citation
 PubChem, PC Fluorescence-based biochemical high throughput dose response assay for inhibitors of the fructose-bisphosphate aldolase (FBA) of M. tuberculosis PubChem Bioassay (2013)[AID] 
Target
Name:
Fructose-bisphosphate aldolase
Synonyms:
ALF_MYCTU FBPA Fructose-1,6-bisphosphate aldolase (FBA) Probable fructose-bisphosphate aldolase Fba | fba
Type:
Protein
Mol. Mass.:
36539.01
Organism:
Mycobacterium tuberculosis (strain H37Rv)
Description:
P9WQA3
Residue:
344
  
Inhibitor
Name:
BDBM96150
Synonyms:
3-Bromo-2-(4,6-dimethyl-pyrimidin-2-ylsulfanylmethyl)-imidazo[1,2-a]pyrimidine 3-bromo-2-[(4,6-dimethylpyrimidin-2-yl)sulfanylmethyl]imidazo[1,2-a]pyrimidine 3-bromo-2-[[(4,6-dimethylpyrimidin-2-yl)thio]methyl]imidazo[1,2-a]pyrimidine SMR000146341 | cid_3731510
Type:
Small organic molecule
Emp. Form.:
C13H12BrN5S
Mol. Mass.:
350.237
SMILES:
Cc1cc(C)nc(SCc2nc3ncccn3c2Br)n1
: