Target
Fructose-bisphosphate aldolase
Ligand
BDBM96157
Substrate
IC50
2232±n/a nM
Citation
 PubChem, PC Fluorescence-based biochemical high throughput dose response assay for inhibitors of the fructose-bisphosphate aldolase (FBA) of M. tuberculosis PubChem Bioassay (2013)[AID] 
Target
Name:
Fructose-bisphosphate aldolase
Synonyms:
ALF_MYCTU FBPA Fructose-1,6-bisphosphate aldolase (FBA) Probable fructose-bisphosphate aldolase Fba | fba
Type:
Protein
Mol. Mass.:
36539.01
Organism:
Mycobacterium tuberculosis (strain H37Rv)
Description:
P9WQA3
Residue:
344
  
Inhibitor
Name:
BDBM96157
Synonyms:
4,7-dimethoxy-3-methyl-2,3-dihydroinden-1-one MLS003107222 cid_308152
Type:
Small organic molecule
Emp. Form.:
C12H14O3
Mol. Mass.:
206.2378
SMILES:
COc1ccc(OC)c2C(=O)CC(C)c12
: