Target
Fructose-bisphosphate aldolase
Ligand
BDBM96159
Substrate
IC50
>369.98±n/a nM
Citation
 PubChem, PC Fluorescence-based biochemical high throughput dose response assay for inhibitors of the fructose-bisphosphate aldolase (FBA) of M. tuberculosis PubChem Bioassay (2013)[AID] 
Target
Name:
Fructose-bisphosphate aldolase
Synonyms:
ALF_MYCTU FBPA Fructose-1,6-bisphosphate aldolase (FBA) Probable fructose-bisphosphate aldolase Fba | fba
Type:
Protein
Mol. Mass.:
36539.01
Organism:
Mycobacterium tuberculosis (strain H37Rv)
Description:
P9WQA3
Residue:
344
  
Inhibitor
Name:
BDBM96159
Synonyms:
MLS000730301 N-[3-(diethylamino)propyl]-N'-[4-methyl-2-(4-methyl-1-piperidinyl)-6-quinolinyl]butanediamide N-[3-(diethylamino)propyl]-N'-[4-methyl-2-(4-methylpiperidino)-6-quinolyl]succinamide cid_16188839
Type:
Small organic molecule
Emp. Form.:
C27H41N5O2
Mol. Mass.:
467.6467
SMILES:
CCN(CC)CCCNC(=O)CCC(=O)Nc1ccc2nc(cc(C)c2c1)N1CCC(C)CC1
: