Target
Fructose-bisphosphate aldolase
Ligand
BDBM96175
Substrate
IC50
2594±n/a nM
Citation
 PubChem, PC Fluorescence-based biochemical high throughput dose response assay for inhibitors of the fructose-bisphosphate aldolase (FBA) of M. tuberculosis PubChem Bioassay (2013)[AID] 
Target
Name:
Fructose-bisphosphate aldolase
Synonyms:
ALF_MYCTU FBPA Fructose-1,6-bisphosphate aldolase (FBA) Probable fructose-bisphosphate aldolase Fba | fba
Type:
Protein
Mol. Mass.:
36539.01
Organism:
Mycobacterium tuberculosis (strain H37Rv)
Description:
P9WQA3
Residue:
344
  
Inhibitor
Name:
BDBM96175
Synonyms:
5-ethoxy-3-methyl-2-benzofurancarboxylic acid [2-(cyclopentylamino)-2-oxoethyl] ester MLS002169910 [2-(cyclopentylamino)-2-oxidanylidene-ethyl] 5-ethoxy-3-methyl-1-benzofuran-2-carboxylate cid_2563328
Type:
Small organic molecule
Emp. Form.:
C19H23NO5
Mol. Mass.:
345.3896
SMILES:
CCOc1ccc2oc(C(=O)OCC(=O)NC3CCCC3)c(C)c2c1
: