Target
Fructose-bisphosphate aldolase
Ligand
BDBM96221
Substrate
IC50
>9989±n/a nM
Citation
 PubChem, PC Fluorescence-based biochemical high throughput dose response assay for inhibitors of the fructose-bisphosphate aldolase (FBA) of M. tuberculosis PubChem Bioassay (2013)[AID] 
Target
Name:
Fructose-bisphosphate aldolase
Synonyms:
ALF_MYCTU FBPA Fructose-1,6-bisphosphate aldolase (FBA) Probable fructose-bisphosphate aldolase Fba | fba
Type:
Protein
Mol. Mass.:
36539.01
Organism:
Mycobacterium tuberculosis (strain H37Rv)
Description:
P9WQA3
Residue:
344
  
Inhibitor
Name:
BDBM96221
Synonyms:
1,4,5-triphenylpyrrolidine-2,3-dione MLS002639052 cid_230436
Type:
Small organic molecule
Emp. Form.:
C22H17NO2
Mol. Mass.:
327.3759
SMILES:
O=C1C(C(N(C1=O)c1ccccc1)c1ccccc1)c1ccccc1
: