Target
RecBCD enzyme subunit RecD
Ligand
BDBM96263
Substrate
IC50
26913±n/a nM
Citation
 PubChem, PC Absorbance-based bacterial cell-based high throughput dose response assay to identify inhibitors of RecBCD PubChem Bioassay (2013)[AID] 
Target
Name:
RecBCD enzyme subunit RecD
Synonyms:
RECD_ECOLI hopE | recD
Type:
Enzyme Catalytic Domain
Mol. Mass.:
66906.68
Organism:
Escherichia coli str. K-12 substr. MG1655
Description:
gi_16130723
Residue:
608
  
Inhibitor
Name:
BDBM96263
Synonyms:
MLS001077224 N-(3-acetylphenyl)-5-nitro-2-furancarboxamide N-(3-ethanoylphenyl)-5-nitro-furan-2-carboxamide cid_823973
Type:
Small organic molecule
Emp. Form.:
C13H10N2O5
Mol. Mass.:
274.2289
SMILES:
CC(=O)c1cccc(NC(=O)c2ccc(o2)[N+]([O-])=O)c1
: