Target
RecBCD enzyme subunit RecD
Ligand
BDBM50356932
Substrate
IC50
>118767±n/a nM
Citation
 PubChem, PC Absorbance-based bacterial cell-based high throughput dose response assay to identify inhibitors of RecBCD PubChem Bioassay (2013)[AID] 
Target
Name:
RecBCD enzyme subunit RecD
Synonyms:
RECD_ECOLI hopE | recD
Type:
Enzyme Catalytic Domain
Mol. Mass.:
66906.68
Organism:
Escherichia coli str. K-12 substr. MG1655
Description:
gi_16130723
Residue:
608
  
Inhibitor
Name:
BDBM50356932
Synonyms:
CHEMBL1889525 | cid_40237
Type:
Small organic molecule
Emp. Form.:
C7H5ClN2O
Mol. Mass.:
168.58
SMILES:
Nc1nc2ccc(Cl)cc2o1
: