Target
RecBCD enzyme subunit RecD
Ligand
BDBM80820
Substrate
IC50
87291±n/a nM
Citation
 PubChem, PC Absorbance-based bacterial cell-based high throughput dose response assay to identify inhibitors of RecBCD PubChem Bioassay (2013)[AID] 
Target
Name:
RecBCD enzyme subunit RecD
Synonyms:
RECD_ECOLI hopE | recD
Type:
Enzyme Catalytic Domain
Mol. Mass.:
66906.68
Organism:
Escherichia coli str. K-12 substr. MG1655
Description:
gi_16130723
Residue:
608
  
Inhibitor
Name:
BDBM80820
Synonyms:
1-(2-pyridinylmethyl)-3-(2-pyridinylmethylideneamino)thiourea 1-(pyridin-2-ylmethyl)-3-(pyridin-2-ylmethylideneamino)thiourea SMR001565798 | cid_3005742
Type:
Small organic molecule
Emp. Form.:
C13H13N5S
Mol. Mass.:
271.341
SMILES:
S=C(NCc1ccccn1)NN=Cc1ccccn1
: