Target
RecBCD enzyme subunit RecD
Ligand
BDBM91517
Substrate
IC50
23101±n/a nM
Citation
 PubChem, PC Absorbance-based bacterial cell-based high throughput dose response assay to identify inhibitors of RecBCD PubChem Bioassay (2013)[AID] 
Target
Name:
RecBCD enzyme subunit RecD
Synonyms:
RECD_ECOLI hopE | recD
Type:
Enzyme Catalytic Domain
Mol. Mass.:
66906.68
Organism:
Escherichia coli str. K-12 substr. MG1655
Description:
gi_16130723
Residue:
608
  
Inhibitor
Name:
BDBM91517
Synonyms:
5-Nitro-furan-2-carboxylic acid (3-nitro-phenyl)-amide 5-nitro-N-(3-nitrophenyl)-2-furancarboxamide MLS001209600 cid_3089184
Type:
Small organic molecule
Emp. Form.:
C11H7N3O6
Mol. Mass.:
277.1898
SMILES:
[O-][N+](=O)c1ccc(o1)C(=O)Nc1cccc(c1)[N+]([O-])=O
: