Target
T cell receptor alpha variable 4
Ligand
BDBM96312
Substrate
IC50
>94012±n/a nM
Citation
 PubChem, PC Fluorescence-based biochemical primary high throughput dose response assay to identify inhibitors of T-cell receptor (TCR)-CD3 interaction using a TAMRA-labeled TCR probe PubChem Bioassay (2013)[AID] 
Target
Name:
T cell receptor alpha variable 4
Synonyms:
TCRAV4S1 TVA4_HUMAN
Type:
Enzyme Catalytic Domain
Mol. Mass.:
12216.28
Organism:
Homo sapiens (Human)
Description:
A0A0B4J268
Residue:
109
  
Inhibitor
Name:
BDBM96312
Synonyms:
1-[[1-(3,4-dichlorobenzyl)-2-keto-nicotinoyl]amino]-3-methyl-thiourea 1-[[1-[(3,4-dichlorophenyl)methyl]-2-oxopyridine-3-carbonyl]amino]-3-methylthiourea 2-{[1-(3,4-dichlorobenzyl)-2-oxo-1,2-dihydro-3-pyridinyl]carbonyl}-N-methyl-1-hydrazinecarbothioamide SMR000169273 | cid_2764881
Type:
Small organic molecule
Emp. Form.:
C15H14Cl2N4O2S
Mol. Mass.:
385.268
SMILES:
CNC(=S)NNC(=O)c1cccn(Cc2ccc(Cl)c(Cl)c2)c1=O
: