Target
T cell receptor alpha variable 4
Ligand
BDBM43104
Substrate
IC50
14747±n/a nM
Citation
 PubChem, PC Fluorescence-based biochemical primary high throughput dose response assay to identify inhibitors of T-cell receptor (TCR)-CD3 interaction using a TAMRA-labeled TCR probe PubChem Bioassay (2013)[AID] 
Target
Name:
T cell receptor alpha variable 4
Synonyms:
TCRAV4S1 TVA4_HUMAN
Type:
Enzyme Catalytic Domain
Mol. Mass.:
12216.28
Organism:
Homo sapiens (Human)
Description:
A0A0B4J268
Residue:
109
  
Inhibitor
Name:
BDBM43104
Synonyms:
2-(3-bromophenyl)-4-quinolinecarboxylic acid [2-[3-(dimethylsulfamoyl)anilino]-2-oxoethyl] ester MLS000409164 [2-[3-(dimethylsulfamoyl)anilino]-2-oxoethyl] 2-(3-bromophenyl)quinoline-4-carboxylate cid_4173883
Type:
Small organic molecule
Emp. Form.:
C26H22BrN3O5S
Mol. Mass.:
568.439
SMILES:
CN(C)S(=O)(=O)c1cccc(NC(=O)COC(=O)c2cc(nc3ccccc23)-c2cccc(Br)c2)c1
: